(view as text)
Making check in po
gmake[1]: Entering directory '/export/home/buildbot/slave/rrdtool_gcc-solaris10-i386/build/po'
gmake[1]: Leaving directory '/export/home/buildbot/slave/rrdtool_gcc-solaris10-i386/build/po'
Making check in src
gmake[1]: Entering directory '/export/home/buildbot/slave/rrdtool_gcc-solaris10-i386/build/src'
gmake[1]: Leaving directory '/export/home/buildbot/slave/rrdtool_gcc-solaris10-i386/build/src'
Making check in doc
gmake[1]: Entering directory '/export/home/buildbot/slave/rrdtool_gcc-solaris10-i386/build/doc'
gmake[1]: Nothing to be done for 'check'.
gmake[1]: Leaving directory '/export/home/buildbot/slave/rrdtool_gcc-solaris10-i386/build/doc'
Making check in bindings
gmake[1]: Entering directory '/export/home/buildbot/slave/rrdtool_gcc-solaris10-i386/build/bindings'
gmake[2]: Entering directory '/export/home/buildbot/slave/rrdtool_gcc-solaris10-i386/build/bindings'
mkdir -p ./perl-piped
( cd ./perl-piped \
&& ( test -e Makefile.PL || ln -s /export/home/buildbot/slave/rrdtool_gcc-solaris10-i386/build/bindings/perl-piped/Makefile.PL ) \
&& ( test -e RRDp.pm || ln -s /export/home/buildbot/slave/rrdtool_gcc-solaris10-i386/build/bindings/perl-piped/RRDp.pm ) \
&& ( test -e t || ln -s /export/home/buildbot/slave/rrdtool_gcc-solaris10-i386/build/bindings/perl-piped/t ) \
&& env \
ABS_TOP_SRCDIR=/export/home/buildbot/slave/rrdtool_gcc-solaris10-i386/build \
ABS_TOP_BUILDDIR=/export/home/buildbot/slave/rrdtool_gcc-solaris10-i386/build \
ABS_SRCDIR=/export/home/buildbot/slave/rrdtool_gcc-solaris10-i386/build/bindings/perl-piped \
/usr/bin/perl Makefile.PL PREFIX=/opt/rrdtool-1.5.5 INSTALL_BASE= LIB=/opt/rrdtool-1.5.5/lib/perl/5.8.4 \
&& gmake )
'INSTALL_BASE' is not a known MakeMaker parameter name.
Writing Makefile for RRDp
gmake[3]: Entering directory '/export/home/buildbot/slave/rrdtool_gcc-solaris10-i386/build/bindings/perl-piped'
Manifying blib/man3/RRDp.3
gmake[3]: Leaving directory '/export/home/buildbot/slave/rrdtool_gcc-solaris10-i386/build/bindings/perl-piped'
mkdir -p ./perl-shared
( cd ./perl-shared \
&& ( test -e Makefile.PL || ln -s /export/home/buildbot/slave/rrdtool_gcc-solaris10-i386/build/bindings/perl-shared/Makefile.PL ) \
&& ( test -e RRDs.pm || ln -s /export/home/buildbot/slave/rrdtool_gcc-solaris10-i386/build/bindings/perl-shared/RRDs.pm ) \
&& ( test -e RRDs.ppd || ln -s /export/home/buildbot/slave/rrdtool_gcc-solaris10-i386/build/bindings/perl-shared/RRDs.ppd ) \
&& ( test -e RRDs.xs || ln -s /export/home/buildbot/slave/rrdtool_gcc-solaris10-i386/build/bindings/perl-shared/RRDs.xs ) \
&& ( test -e t || ln -s /export/home/buildbot/slave/rrdtool_gcc-solaris10-i386/build/bindings/perl-shared/t ) \
&& env \
ABS_TOP_SRCDIR=/export/home/buildbot/slave/rrdtool_gcc-solaris10-i386/build \
ABS_TOP_BUILDDIR=/export/home/buildbot/slave/rrdtool_gcc-solaris10-i386/build \
ABS_SRCDIR=/export/home/buildbot/slave/rrdtool_gcc-solaris10-i386/build/bindings/perl-shared \
/usr/bin/perl Makefile.PL PREFIX=/opt/rrdtool-1.5.5 INSTALL_BASE= LIB=/opt/rrdtool-1.5.5/lib/perl/5.8.4 RPATH=/opt/rrdtool-1.5.5/lib \
&& gmake )
'INSTALL_BASE' is not a known MakeMaker parameter name.
Writing Makefile for RRDs
gmake[3]: Entering directory '/export/home/buildbot/slave/rrdtool_gcc-solaris10-i386/build/bindings/perl-shared'
cc -c -I/export/home/buildbot/slave/rrdtool_gcc-solaris10-i386/build/src -I/export/home/buildbot/slave/rrdtool_gcc-solaris10-i386/build/src -D_LARGEFILE_SOURCE -D_FILE_OFFSET_BITS=64 -D_TS_ERRNO -xO3 -xspace -xildoff -DVERSION=\"1.5001\" -DXS_VERSION=\"1.5001\" -KPIC "-I/usr/perl5/5.8.4/lib/i86pc-solaris-64int/CORE" -DPERLPATCHLEVEL=8 RRDs.c
"/export/home/buildbot/slave/rrdtool_gcc-solaris10-i386/build/src/rrd.h", line 136: warning: modification of typedef with "int" ignored
"RRDs.xs", line 581: warning: argument #1 is incompatible with prototype:
prototype: pointer to const char : "/usr/perl5/5.8.4/lib/i86pc-solaris-64int/CORE/proto.h", line 520
argument : pointer to unsigned char
"RRDs.xs", line 594: warning: argument #1 is incompatible with prototype:
prototype: pointer to const char : "/usr/perl5/5.8.4/lib/i86pc-solaris-64int/CORE/proto.h", line 520
argument : pointer to unsigned char
"RRDs.xs", line 609: warning: argument #1 is incompatible with prototype:
prototype: pointer to const char : "/usr/perl5/5.8.4/lib/i86pc-solaris-64int/CORE/proto.h", line 520
argument : pointer to unsigned char
Running Mkbootstrap for RRDs ()
chmod 644 RRDs.bs
rm -f blib/arch/auto/RRDs/RRDs.so
LD_RUN_PATH="" cc -G RRDs.o -L/export/home/buildbot/slave/rrdtool_gcc-solaris10-i386/build/src/.libs/ -R/opt/rrdtool-1.5.5/lib -lrrd -o blib/arch/auto/RRDs/RRDs.so
chmod 755 blib/arch/auto/RRDs/RRDs.so
cp RRDs.bs blib/arch/auto/RRDs/RRDs.bs
chmod 644 blib/arch/auto/RRDs/RRDs.bs
Manifying blib/man3/RRDs.3
gmake[3]: Leaving directory '/export/home/buildbot/slave/rrdtool_gcc-solaris10-i386/build/bindings/perl-shared'
mkdir -p ./perl-shared
mkdir -p ./ruby
( cd ./ruby \
&& /opt/csw/bin/ruby /export/home/buildbot/slave/rrdtool_gcc-solaris10-i386/build/bindings/ruby/extconf.rb \
&& gmake \
EPREFIX=/opt/rrdtool-1.5.5 \
ABS_TOP_SRCDIR=/export/home/buildbot/slave/rrdtool_gcc-solaris10-i386/build \
ABS_TOP_BUILDDIR=/export/home/buildbot/slave/rrdtool_gcc-solaris10-i386/build \
sitedir=/opt/rrdtool-1.5.5/lib/ruby RUBYARCHDIR= )
checking for rrd_create() in -lrrd... yes
creating Makefile
gmake[3]: Entering directory '/export/home/buildbot/slave/rrdtool_gcc-solaris10-i386/build/bindings/ruby'
linking shared-object RRD.so
gmake[3]: Leaving directory '/export/home/buildbot/slave/rrdtool_gcc-solaris10-i386/build/bindings/ruby'
mkdir -p ./python
cd ./python \
&& ( test -e rrdtoolmodule.c || ln -s /export/home/buildbot/slave/rrdtool_gcc-solaris10-i386/build/bindings/python/rrdtoolmodule.c ) \
&& env \
ABS_TOP_SRCDIR=/export/home/buildbot/slave/rrdtool_gcc-solaris10-i386/build \
ABS_TOP_BUILDDIR=/export/home/buildbot/slave/rrdtool_gcc-solaris10-i386/build \
LD_RUN_PATH=/opt/rrdtool-1.5.5/lib \
/usr/bin/python /export/home/buildbot/slave/rrdtool_gcc-solaris10-i386/build/bindings/python/setup.py build_ext --rpath=/opt/rrdtool-1.5.5/lib \
&& env \
ABS_TOP_SRCDIR=/export/home/buildbot/slave/rrdtool_gcc-solaris10-i386/build \
ABS_TOP_BUILDDIR=/export/home/buildbot/slave/rrdtool_gcc-solaris10-i386/build \
/usr/bin/python /export/home/buildbot/slave/rrdtool_gcc-solaris10-i386/build/bindings/python/setup.py build
running build_ext
running build
running build_ext
gmake[2]: Leaving directory '/export/home/buildbot/slave/rrdtool_gcc-solaris10-i386/build/bindings'
gmake[1]: Leaving directory '/export/home/buildbot/slave/rrdtool_gcc-solaris10-i386/build/bindings'
Making check in tests
gmake[1]: Entering directory '/export/home/buildbot/slave/rrdtool_gcc-solaris10-i386/build/tests'
gmake check-TESTS
gmake[2]: Entering directory '/export/home/buildbot/slave/rrdtool_gcc-solaris10-i386/build/tests'
gmake[3]: Entering directory '/export/home/buildbot/slave/rrdtool_gcc-solaris10-i386/build/tests'
PASS: modify1
PASS: modify2
PASS: modify3
PASS: modify4
PASS: modify5
PASS: tune1
PASS: tune2
PASS: rpn1
FAIL: rpn2
PASS: rrdcreate
PASS: dump-restore
PASS: create-with-source-1
PASS: create-with-source-2
PASS: create-with-source-3
PASS: create-with-source-4
PASS: create-with-source-and-mapping-1
PASS: create-from-template-1
FAIL: dcounter1
FAIL: vformatter1
PASS: xport1
gmake[4]: Entering directory '/export/home/buildbot/slave/rrdtool_gcc-solaris10-i386/build/tests'
gmake[4]: Nothing to be done for 'all'.
gmake[4]: Leaving directory '/export/home/buildbot/slave/rrdtool_gcc-solaris10-i386/build/tests'
============================================================================
Testsuite summary for rrdtool 1.5.5
============================================================================
# TOTAL: 20
# PASS: 17
# SKIP: 0
# XFAIL: 0
# FAIL: 3
# XPASS: 0
# ERROR: 0
============================================================================
See tests/test-suite.log
============================================================================
Makefile:622: recipe for target 'test-suite.log' failed
gmake[3]: Leaving directory '/export/home/buildbot/slave/rrdtool_gcc-solaris10-i386/build/tests'
gmake[3]: *** [test-suite.log] Error 1
Makefile:728: recipe for target 'check-TESTS' failed
gmake[2]: Leaving directory '/export/home/buildbot/slave/rrdtool_gcc-solaris10-i386/build/tests'
gmake[2]: *** [check-TESTS] Error 2
Makefile:934: recipe for target 'check-am' failed
gmake[1]: Leaving directory '/export/home/buildbot/slave/rrdtool_gcc-solaris10-i386/build/tests'
gmake[1]: *** [check-am] Error 2
Makefile:557: recipe for target 'check-recursive' failed
gmake: *** [check-recursive] Error 1