(view as text)
gmake[1]: Entering directory '/export/home/buildbot/slave/doxygen-solaris10-i386/build/solaris'
gmake[2]: Entering directory '/export/home/buildbot/slave/doxygen-solaris10-i386/build/solaris'
gmake[3]: Entering directory '/export/home/buildbot/slave/doxygen-solaris10-i386/build/solaris'
Scanning dependencies of target generate_configvalues_header
gmake[3]: Leaving directory '/export/home/buildbot/slave/doxygen-solaris10-i386/build/solaris'
gmake[3]: Entering directory '/export/home/buildbot/slave/doxygen-solaris10-i386/build/solaris'
[ 0%] Generating ../generated_src/configvalues.h
gmake[3]: Leaving directory '/export/home/buildbot/slave/doxygen-solaris10-i386/build/solaris'
[ 0%] Built target generate_configvalues_header
gmake[3]: Entering directory '/export/home/buildbot/slave/doxygen-solaris10-i386/build/solaris'
Scanning dependencies of target spdlog
gmake[3]: Leaving directory '/export/home/buildbot/slave/doxygen-solaris10-i386/build/solaris'
gmake[3]: Entering directory '/export/home/buildbot/slave/doxygen-solaris10-i386/build/solaris'
[ 0%] Building CXX object deps/spdlog/CMakeFiles/spdlog.dir/src/spdlog.cpp.o
>> Assertion: (../lnk/reresolve.cc, line 296)
while processing /export/home/buildbot/slave/doxygen-solaris10-i386/build/deps/spdlog/include/spdlog/fmt/bundled/format.h at line 4513.
gmake[3]: *** [deps/spdlog/CMakeFiles/spdlog.dir/build.make:63: deps/spdlog/CMakeFiles/spdlog.dir/src/spdlog.cpp.o] Error 2
gmake[3]: Leaving directory '/export/home/buildbot/slave/doxygen-solaris10-i386/build/solaris'
gmake[2]: *** [CMakeFiles/Makefile2:286: deps/spdlog/CMakeFiles/spdlog.dir/all] Error 2
gmake[2]: Leaving directory '/export/home/buildbot/slave/doxygen-solaris10-i386/build/solaris'
gmake[1]: Leaving directory '/export/home/buildbot/slave/doxygen-solaris10-i386/build/solaris'
gmake[1]: *** [CMakeFiles/Makefile2:928: testing/CMakeFiles/tests.dir/rule] Error 2
gmake: *** [Makefile:393: tests] Error 2